Ocimenone

Normal alkane RI, non-polar column, temperature ramp

View large format table.

Column type Active phase I Reference Comment
CapillaryDB-51230.Chagonda and Chalchat, 200525. m/0.25 mm/0.15 μm, 40. C @ 5. min, 3. K/min; Tend: 220. C

References

Chagonda and Chalchat, 2005
Chagonda, L.S.; Chalchat, J.-C., The essential oil of the fruit of Garcinia huillensis Welw. ex. Oliv. from Zimbabwe, Flavour Fragr. J., 2005, 20, 3, 313-315, https://doi.org/10.1002/ffj.1420 . [all data]