12-ethoxy-8 α,12-epoxy-13,14,15,16-tertanorlabdane

Normal alkane RI, polar column, temperature ramp

View large format table.

Column type Active phase I Reference Comment
CapillaryPEG-20M2317.Awano, Ishizaki, et al., 2005N2, 3. K/min; Column length: 60. m; Column diameter: 0.25 mm; Tstart: 70. C; Tend: 220. C
CapillaryPEG-20M2320.Awano, Ishizaki, et al., 2005N2, 3. K/min; Column length: 60. m; Column diameter: 0.25 mm; Tstart: 70. C; Tend: 220. C
CapillaryPEG-20M2348.Awano, Ishizaki, et al., 2005N2, 3. K/min; Column length: 60. m; Column diameter: 0.25 mm; Tstart: 70. C; Tend: 220. C
CapillaryPEG-20M2353.Awano, Ishizaki, et al., 2005N2, 3. K/min; Column length: 60. m; Column diameter: 0.25 mm; Tstart: 70. C; Tend: 220. C

References

Awano, Ishizaki, et al., 2005
Awano, K.; Ishizaki, S.; Takazawa, O.; Kitahara, T., Analysis of ambergris tincture, Flavour Fragr. J., 2005, 20, 1, 18-21, https://doi.org/10.1002/ffj.1413 . [all data]