N-(2'-Methylbutyl)pyrrolidine

Normal alkane RI, polar column, custom temperature program

Data compiled by: NIST Mass Spectrometry Data Center, William E. Wallace, director

Column type Capillary
Active phase TC-Wax
Column length (m)
Carrier gas
Substrate
Column diameter (mm)
Phase thickness (μm)
Program not specified
I 1093.
ReferenceTachihara, Ishizaki, et al., 2004
Comment MSDC-RI

References

Tachihara, Ishizaki, et al., 2004
Tachihara, T.; Ishizaki, S.; Ishikawa, M.; Kitahara, T., Studies on the volatile compounds of roasted spotted shrimp, Chemistry Biodiversity, 2004, 1, 12, 2024-2033, https://doi.org/10.1002/cbdv.200490155 . [all data]