τ-cadinene

Normal alkane RI, non-polar column, temperature ramp

View large format table.

Column type Active phase I Reference Comment
CapillaryDB-51505.Suyenaga, Apel, et al., 200430. m/0.25 mm/0.25 μm, 3. K/min; Tstart: 60. C; Tend: 300. C

References

Suyenaga, Apel, et al., 2004
Suyenaga, E.S.; Apel, M.A.; Chaves, C.G.; Zuanazzi, J.A.; Henriques, A.T., Essential oil composition of Heterothalamus psiadioides Less, Biochem. Syst. Ecol., 2004, 32, 1, 83-86, https://doi.org/10.1016/S0305-1978(03)00190-X . [all data]