Viridene (2-penten-1-yl-3-cyclohexadiene)

Normal alkane RI, non-polar column, temperature ramp

View large format table.

Column type Active phase I Reference Comment
CapillaryDB-11157.Palá-Paúl, García-Jiménez, et al., 200450. m/0.22 mm/0.25 μm, He, 4. K/min; Tstart: 70. C; Tend: 220. C

Normal alkane RI, polar column, temperature ramp

View large format table.

Column type Active phase I Reference Comment
CapillaryInnowax1416.Palá-Paúl, García-Jiménez, et al., 200450. m/0.2 mm/0.2 μm, He, 4. K/min; Tstart: 70. C; Tend: 220. C

References

Palá-Paúl, García-Jiménez, et al., 2004
Palá-Paúl, J.; García-Jiménez, R.; Pérez-Alonso, M.J.; Velasco-Negueruela, A.; Sanz, J., Essential oil composition of the leaves and stems of Meum athamanticum Jacq., from Spain, J. Chromatogr. A, 2004, 1036, 2, 245-247, https://doi.org/10.1016/j.chroma.2004.02.064 . [all data]