isobornyl2-methylbutanoate

Van Den Dool and Kratz RI, non-polar column, custom temperature program

View large format table.

Column type Active phase I Reference Comment
CapillaryHP-5MS1524.Akpulat, Tepe, et al., 200530. m/0.25 mm/0.25 μm, He; Program: 50C (3min) => 3C/min => 200C => 6C/min => 240C

Normal alkane RI, non-polar column, custom temperature program

View large format table.

Column type Active phase I Reference Comment
CapillaryDB-51524.Letchamo, Ward, et al., 200430. m/0.25 mm/0.25 μm, He; Program: 60C(4min) => 6C/min => 240 => 10C/min => 280C

References

Akpulat, Tepe, et al., 2005
Akpulat, H.A.; Tepe, B.; Sokmen, A.; Daferera, D.; Polissiou, M., Composition of the essential oils of Tanacetum argyrophyllum (C. Koch) Tvzel. var. argyrophyllum and Tanacetum parthenium (L.) Schultz Bip. (Asteraceae) from Turkey, Biochem. Syst. Ecol., 2005, 33, 5, 511-516, https://doi.org/10.1016/j.bse.2004.10.006 . [all data]

Letchamo, Ward, et al., 2004
Letchamo, W.; Ward, W.; Heard, B.; Heard, D., Essential oil of Valeriana officinalis L. cultivars and their antimicrobial activity as influenced by harvesting time under commercial organic cultivation, J. Agric. Food Chem., 2004, 52, 12, 3915-3919, https://doi.org/10.1021/jf0353990 . [all data]