3-hydroxy-1,8-cineole

Normal alkane RI, non-polar column, temperature ramp

Data compiled by: NIST Mass Spectrometry Data Center, William E. Wallace, director

Column type CapillaryCapillary
Active phase SPB-5SE-54
Column length (m) 30.30.
Carrier gas HeHe
Substrate
Column diameter (mm) 0.530.25
Phase thickness (μm)  0.25
Tstart (C) 100.60.
Tend (C) 250.260.
Heat rate (K/min) 5.2.
Initial hold (min)  5.
Final hold (min)
I 1258.1239.
ReferenceKilic, Kollmannsberger, et al., 2005Kilic, Hafizoglu, et al., 2004
Comment MSDC-RI MSDC-RI

References

Kilic, Kollmannsberger, et al., 2005
Kilic, A.; Kollmannsberger, H.; Nitz, S., Glycosidically bound volatiles and flavor precursors in Laurus nobilis L., J. Agric. Food Chem., 2005, 53, 6, 2231-2235, https://doi.org/10.1021/jf040373+ . [all data]

Kilic, Hafizoglu, et al., 2004
Kilic, A.; Hafizoglu, H.; Kollmannsberger, H.; Nitz, S., Volatile constituents and key odorants in leaves, buds, flowers, and fruits of Laurus nobilis L., J. Agric. Food Chem., 2004, 52, 6, 1601-1606, https://doi.org/10.1021/jf0306237 . [all data]