α-Cedrane, epi-

Van Den Dool and Kratz RI, non-polar column, temperature ramp

Data compiled by: NIST Mass Spectrometry Data Center, William E. Wallace, director

Column type Capillary
Active phase HP-5
Column length (m) 30.
Carrier gas He
Substrate
Column diameter (mm) 0.25
Phase thickness (μm) 0.25
Tstart (C) 40.
Tend (C) 250.
Heat rate (K/min) 3.
Initial hold (min)
Final hold (min)
I 1440.
ReferenceIsidorov, Krajewska, et al., 2004
Comment MSDC-RI

References

Isidorov, Krajewska, et al., 2004
Isidorov, V.A.; Krajewska, U.; Vinogorova, V.T.; Vetchinnikova, L.V.; Fuksman, I.L.; Bal, K., Gas chromatographic analysis of essential oil from buds of different birch species with preliminary partition of components, Biochem. Syst. Ecol., 2004, 32, 1, 1-13, https://doi.org/10.1016/S0305-1978(03)00175-3 . [all data]