p-Menth-2-en-1,4-diol

Van Den Dool and Kratz RI, non-polar column, temperature ramp

View large format table.

Column type Active phase I Reference Comment
CapillaryBP-11256.Lesueur, de Rocca Serra, et al., 200750. m/0.22 mm/0.25 μm, He, 2. K/min, 220. C @ 20. min; Tstart: 60. C

Van Den Dool and Kratz RI, polar column, temperature ramp

View large format table.

Column type Active phase I Reference Comment
CapillaryBP-202064.Lesueur, de Rocca Serra, et al., 200750. m/0.22 mm/0.25 μm, He, 2. K/min, 220. C @ 20. min; Tstart: 60. C

Normal alkane RI, non-polar column, temperature ramp

View large format table.

Column type Active phase I Reference Comment
CapillaryRTX-11245.Cavalli, Tomi, et al., 200460. m/0.22 mm/0.25 μm, He, 2. K/min, 230. C @ 45. min; Tstart: 60. C

Normal alkane RI, polar column, temperature ramp

View large format table.

Column type Active phase I Reference Comment
CapillaryRTX-Wax2073.Cavalli, Tomi, et al., 200460. m/0.22 mm/0.25 μm, He, 2. K/min, 230. C @ 45. min; Tstart: 60. C

References

Lesueur, de Rocca Serra, et al., 2007
Lesueur, D.; de Rocca Serra, D.; Bighelli, A.; Hoi, T.M.; Ban, N.K.; Thai, T.H.; Casanova, J., Chemical composition and antibacterial activity of the essential oil of Michelia foveolata Merryll ex Dandy from Vietnam, Flavour Fragr. J., 2007, 22, 4, 317-321, https://doi.org/10.1002/ffj.1799 . [all data]

Cavalli, Tomi, et al., 2004
Cavalli, J.-F.; Tomi, F.; Bernardini, A.-F.; Casanova, J., Combined Analysis of the Essential Oil of Chenopodium ambrosioides by GC, GC-MS and 13C-NMR Spectroscopy: Quantitative Determination of Ascaridole, a Heat-sensitive Compound, Phytochem. Anal., 2004, 15, 5, 275-279, https://doi.org/10.1002/pca.761 . [all data]