Eudesm-6-en-4 α-ol

Normal alkane RI, non-polar column, temperature ramp

Data compiled by: NIST Mass Spectrometry Data Center, William E. Wallace, director

Column type CapillaryCapillary
Active phase CP Sil 5 CBBP-1
Column length (m) 30.50.
Carrier gas N2
Substrate
Column diameter (mm) 0.320.22
Phase thickness (μm) 0.250.25
Tstart (C) 60.60.
Tend (C) 300.220.
Heat rate (K/min) 4.2.
Initial hold (min)
Final hold (min)  20.
I 1607.1604.
ReferenceBaran, von Reuss, et al., 2007Blanc, Muselli, et al., 2004
Comment MSDC-RI MSDC-RI

References

Baran, von Reuss, et al., 2007
Baran, S.; von Reuss, S.H.; König, W.A.; Kalemba, D., Composition of the essential oil of Abies koreana Wils., Flavour Fragr. J., 2007, 22, 1, 78-83, https://doi.org/10.1002/ffj.1762 . [all data]

Blanc, Muselli, et al., 2004
Blanc, M.-C.; Muselli, A.; Bradesi, P.; Casanova, J., Chemical composition and variability of the essential oil of Inula graveolens from Corsica, Flavour Fragr. J., 2004, 19, 4, 314-319, https://doi.org/10.1002/ffj.1304 . [all data]