(E)-p-mentha-1(7),8-dien-2-hydroperoxide

Normal alkane RI, non-polar column, custom temperature program

Data compiled by: NIST Mass Spectrometry Data Center, William E. Wallace, director

Column type Capillary
Active phase DB-5
Column length (m)
Carrier gas
Substrate
Column diameter (mm)
Phase thickness (μm)
Program not specified
I 1338.
ReferenceAcree and Arn, 2004
Comment MSDC-RI

References

Acree and Arn, 2004
Acree, T.; Arn, H., Flavornet, 2004, retrieved from http://www.flavornet.org/. [all data]