7,7-dimethyl-3-methylene-bicyclo[4.1.0]heptane

Normal alkane RI, non-polar column, custom temperature program

View large format table.

Column type Active phase I Reference Comment
CapillaryDB-51004.Acree and Arn, 2004Program: not specified

References

Acree and Arn, 2004
Acree, T.; Arn, H., Flavornet, 2004, retrieved from http://www.flavornet.org/. [all data]