2,3-Butanediol, bis-TMS, meso

Normal alkane RI, non-polar column, temperature ramp

View large format table.

Column type Active phase I Reference Comment
CapillaryOV-1011042.Zenkevich, 2003Nitrogen, 60. C @ 0. min, 6. K/min, 200. C @ 0. min; Column length: 25. m; Column diameter: 0.25 mm

References

Zenkevich, 2003
Zenkevich, I.G. Kostikov, Prediction of the Gas Chromatographic Elution Order of Diastereomers and Enantiomers using Molecular Dynamics Methods, Zh. Org. Khim. (Rus.), 2003, 39, 8, 1127-1134. [all data]