1-Tetradecanol, 6-chloro, acetate

Kovats' RI, non-polar column, isothermal

View large format table.

Column type Active phase Temperature (C) I Reference Comment
CapillarySE-30180.1988.Haken and Korhonen, 1986N2; Column length: 25. m; Column diameter: 0.33 mm
CapillarySE-30200.1989.Haken and Korhonen, 1986N2; Column length: 25. m; Column diameter: 0.33 mm
CapillarySE-30220.1992.Haken and Korhonen, 1986N2; Column length: 25. m; Column diameter: 0.33 mm

Kovats' RI, polar column, isothermal

View large format table.

Column type Active phase Temperature (C) I Reference Comment
CapillaryOV-351160.2458.Haken and Korhonen, 1986N2; Column length: 25. m; Column diameter: 0.32 mm
CapillaryOV-351180.2472.Haken and Korhonen, 1986N2; Column length: 25. m; Column diameter: 0.32 mm
CapillaryOV-351200.2480.Haken and Korhonen, 1986N2; Column length: 25. m; Column diameter: 0.32 mm
CapillaryOV-351220.2494.Haken and Korhonen, 1986N2; Column length: 25. m; Column diameter: 0.32 mm

References

Haken and Korhonen, 1986
Haken, J.K.; Korhonen, I.O.O., Gas chromatography of homologous esters. XXXII. Capillary chromatography of C1-C18 monochlorinated n-alkyl acetates, J. Chromatogr., 1986, 356, 79-94, https://doi.org/10.1016/S0021-9673(00)91468-7 . [all data]