Selina-5,11-diene

Van Den Dool and Kratz RI, non-polar column, custom temperature program

Data compiled by: NIST Mass Spectrometry Data Center, William E. Wallace, director

Column type Capillary
Active phase CP Sil 5 CB
Column length (m) 25.
Carrier gas H2
Substrate
Column diameter (mm)
Phase thickness (μm)
Program not specified
I 1447.
ReferenceAdio, Paul, et al., 2004
Comment MSDC-RI

References

Adio, Paul, et al., 2004
Adio, A.M.; Paul, C.; Tesso, H.; Kloth, P.; König, W.A., Absolute configuration of helminthogermacrene, Tetrahedron: Asymmetry, 2004, 15, 10, 1631-1635, https://doi.org/10.1016/j.tetasy.2004.03.030 . [all data]