Ethyl- γ-linolenate

Normal alkane RI, polar column, temperature ramp

Data compiled by: NIST Mass Spectrometry Data Center, William E. Wallace, director

Column type Capillary
Active phase TC-Wax
Column length (m) 60.
Carrier gas He
Substrate
Column diameter (mm) 0.25
Phase thickness (μm)
Tstart (C) 80.
Tend (C) 250.
Heat rate (K/min) 4.
Initial hold (min)
Final hold (min) 30.
I 2551.
ReferenceMiyazawa and Okuno, 2003
Comment MSDC-RI

References

Miyazawa and Okuno, 2003
Miyazawa, M.; Okuno, Y., Volatile components from the roots of Scrophularia ningpoensis Hemsl., Flavour Fragr. J., 2003, 18, 5, 398-400, https://doi.org/10.1002/ffj.1232 . [all data]