Isocurcumenol

Normal alkane RI, polar column, temperature ramp

Data compiled by: NIST Mass Spectrometry Data Center, William E. Wallace, director

Column type Capillary
Active phase CP-Wax 52CB
Column length (m) 60.
Carrier gas He
Substrate
Column diameter (mm) 0.25
Phase thickness (μm) 0.25
Tstart (C) 40.
Tend (C) 220.
Heat rate (K/min) 3.
Initial hold (min)
Final hold (min)
I 2403.
ReferenceMau, Lai, et al., 2003
Comment MSDC-RI

References

Mau, Lai, et al., 2003
Mau, J.-L.; Lai, E.Y.C.; Wang, N.-P.; Chen, C.-C.; Chang, C.-H.; Chyau, C.-C., Composition and antioxidant activity of the essential oil from Curcuma zedoaria, Food Chem., 2003, 82, 4, 583-591, https://doi.org/10.1016/S0308-8146(03)00014-1 . [all data]