(+)-Germacrene A

Kovats' RI, non-polar column, temperature ramp

Data compiled by: NIST Mass Spectrometry Data Center, William E. Wallace, director

Column type Capillary
Active phase BP-5
Column length (m) 25.
Carrier gas He
Substrate
Column diameter (mm) 0.25
Phase thickness (μm) 0.25
Tstart (C) 60.
Tend (C) 200.
Heat rate (K/min) 3.
Initial hold (min)
Final hold (min)
I 1506.
ReferenceWeissbecker B., Van Loon J.J.A., et al., 2000
Comment MSDC-RI

References

Weissbecker B., Van Loon J.J.A., et al., 2000
Weissbecker B.; Van Loon J.J.A.; Posthumus M.A.; Bouwmeester H.J.; Dicke M., Identification of volatile potato sesquiterpenoids and their olfactory detection by the two-spotted stinkbug Perillus bioculatus, J. Chem. Ecol., 2000, 26, 6, 1433-1445, https://doi.org/10.1023/A:1005535708866 . [all data]