(+)-β-Costol

Van Den Dool and Kratz RI, non-polar column, custom temperature program

Data compiled by: NIST Mass Spectrometry Data Center, William E. Wallace, director

Column type Capillary
Active phase HP-5MS
Column length (m) 30.
Carrier gas He
Substrate
Column diameter (mm) 0.25
Phase thickness (μm) 0.25
Program not specified
I 1778.
Referencede Kraker, Schurink, et al., 2003
Comment MSDC-RI

References

de Kraker, Schurink, et al., 2003
de Kraker, J.-W.; Schurink, M.; Franssen, M.C.R.; König, W.A.; de Groot, A.; Bouwmeester, H.J., Hydroxylation of sesquiterpenes by enzymes from chicory (Cichorium intybus L.) roots, Tetrahedron, 2003, 59, 3, 409-418, https://doi.org/10.1016/S0040-4020(02)01479-5 . [all data]