Bisabolol (isomer B)

Normal alkane RI, non-polar column, custom temperature program

View large format table.

Column type Active phase I Reference Comment
CapillaryDB-11649.Helmig, Revermann, et al., 200330. m/0.32 mm/0.1 μm, He; Program: 40C (2min) => 20C/min => 80C => 3C/min => 145C => 45C/min => 225C (3min)

References

Helmig, Revermann, et al., 2003
Helmig, D.; Revermann, T.; Pollmann, J.; Kaltschmidt, O.; Hernández, A.J.; Bocquet, F.; David, D., Calibration system and analytical considerations for quantitative sesquiterpene measurements in air, J. Chromatogr. A, 2003, 1002, 1-2, 193-211, https://doi.org/10.1016/S0021-9673(03)00619-8 . [all data]