4-Desmethyl caryophylla-8(14)-en-5-one

Van Den Dool and Kratz RI, non-polar column, temperature ramp

Data compiled by: NIST Mass Spectrometry Data Center, William E. Wallace, director

Column type Capillary
Active phase HP-5
Column length (m) 30.
Carrier gas He
Substrate
Column diameter (mm) 0.25
Phase thickness (μm) 0.25
Tstart (C) 60.
Tend (C) 250.
Heat rate (K/min) 3.
Initial hold (min)
Final hold (min)
I 1539.
ReferenceJavidnia, Miri, et al., 2006
Comment MSDC-RI

References

Javidnia, Miri, et al., 2006
Javidnia, K.; Miri, R.; Kamalinejad, M.; Khazraii, H., Chemical composition of the volatile oil of aerial parts of Valeriana sisymbriifolia Vahl. grown in Iran, Flavour Fragr. J., 2006, 21, 3, 516-518, https://doi.org/10.1002/ffj.1660 . [all data]