4,5-Dihydro-β-caryophyllene-14-al

Normal alkane RI, polar column, custom temperature program

View large format table.

Column type Active phase I Reference Comment
CapillaryHP-Innowax FSC2092.Baser K.H.C. and Demirci B., 200760. m/0.25 mm/0.25 μm, N2; Program: 60C(10min) => 4C/min => 220C(10min) => 1C/min => 240C
CapillaryInnowax FSC2092.Demirci and Baser, 200360. m/0.25 mm/0.25 μm, He; Program: 60C (10min) => 4C/min => 220C (10min) => 1C/min => 240C

References

Baser K.H.C. and Demirci B., 2007
Baser K.H.C.; Demirci B., Studies on Betula essential oils, Arkivoc, 2007, 7, 335-348. [all data]

Demirci and Baser, 2003
Demirci, B.; Baser, K.H.C., Essential oils from the buds of Betula spp. growing in Turkey, Flavour Fragr. J., 2003, 18, 2, 87-90, https://doi.org/10.1002/ffj.1159 . [all data]