14-Acetoxy-α-humulene

Van Den Dool and Kratz RI, non-polar column, temperature ramp

View large format table.

Column type Active phase I Reference Comment
CapillaryHP-51800.Isidorov, Krajewska, et al., 200430. m/0.25 mm/0.25 μm, He, 3. K/min; Tstart: 40. C; Tend: 250. C

Normal alkane RI, polar column, custom temperature program

View large format table.

Column type Active phase I Reference Comment
CapillaryHP-Innowax FSC2329.Baser K.H.C. and Demirci B., 200760. m/0.25 mm/0.25 μm, N2; Program: 60C(10min) => 4C/min => 220C(10min) => 1C/min => 240C
CapillaryHP-Innowax FSC2329.Baser K.H.C. and Demirci B., 200760. m/0.25 mm/0.25 μm, N2; Program: 60C(10min) => 4C/min => 220C(10min) => 1C/min => 240C
CapillaryHP-Innowax FSC2329.Klika, Demirci, et al., 200460. m/0.25 mm/0.25 μm, N2; Program: 60C(10min) => 4C/min => 220C(10min) => 1C/min => 240C
CapillaryInnowax FSC2329.Demirci and Baser, 200360. m/0.25 mm/0.25 μm, He; Program: 60C (10min) => 4C/min => 220C (10min) => 1C/min => 240C

References

Isidorov, Krajewska, et al., 2004
Isidorov, V.A.; Krajewska, U.; Vinogorova, V.T.; Vetchinnikova, L.V.; Fuksman, I.L.; Bal, K., Gas chromatographic analysis of essential oil from buds of different birch species with preliminary partition of components, Biochem. Syst. Ecol., 2004, 32, 1, 1-13, https://doi.org/10.1016/S0305-1978(03)00175-3 . [all data]

Baser K.H.C. and Demirci B., 2007
Baser K.H.C.; Demirci B., Studies on Betula essential oils, Arkivoc, 2007, 7, 335-348. [all data]

Klika, Demirci, et al., 2004
Klika, K.D.; Demirci, B.; Salminen, J.-P.; Ovcharenko, V.V.; Vuorela, S.; Baser, K.H.C.; Pihlaja, K., New, Sesquiterpenoid-Type Bicyclic Compounds from the Buds of Betula pubescens -- Ring-Contracted Products of β-Caryophyllene?, Eur.J.Org.Chem., 2004, 2004, 12, 2627-2635, https://doi.org/10.1002/ejoc.200300808 . [all data]

Demirci and Baser, 2003
Demirci, B.; Baser, K.H.C., Essential oils from the buds of Betula spp. growing in Turkey, Flavour Fragr. J., 2003, 18, 2, 87-90, https://doi.org/10.1002/ffj.1159 . [all data]