2-Methoxyfuranodiene

Normal alkane RI, polar column, custom temperature program

View large format table.

Column type Active phase I Reference Comment
CapillaryInnowax FSC2269.Baser, Demirci, et al., 200360. m/0.25 mm/0.25 μm, He; Program: 60C(10min) => 4C/min => 220C (10min) => 1C/min => 240C

References

Baser, Demirci, et al., 2003
Baser, K.H.C.; Demirci, B.; Dekebo, A.; Dagne, E., Essential oils of some Boswellia spp., myrrh and opopanax, Flavour Fragr. J., 2003, 18, 2, 153-156, https://doi.org/10.1002/ffj.1166 . [all data]