Hydroquinone, 2-trifluoroacetyl, TFA-PFP

Normal alkane RI, non-polar column, temperature ramp

View large format table.

Column type Active phase I Reference Comment
CapillaryOV-1011173.Zenkevich and Rodin, 2002Nitrogen, 60. C @ 0. min, 4. K/min, 240. C @ 0. min; Column length: 25. m; Column diameter: 0.25 mm

References

Zenkevich and Rodin, 2002
Zenkevich, I.G.; Rodin, A.A., Gas Chromatographic One-Step Determination of Number of Hydroxyl Groups in Polyphenols with Mixed Derivatization Reagents, Zh. Anal. Khim. (Rus.), 2002, 57, 7, 732-736. [all data]