Ethane, 1,2-bis-(2-diethylaminoethylthio)

Normal alkane RI, non-polar column, custom temperature program

Data compiled by: NIST Mass Spectrometry Data Center, William E. Wallace, director

Column type CapillaryCapillary
Active phase Methyl SiliconeMethyl Silicone
Column length (m)
Carrier gas
Substrate
Column diameter (mm)
Phase thickness (μm)
Program not specifiednot specified
I 2018.2021.
ReferenceSavelieva and Zenkevich I., 2003Savelieva and Zenkevich I., 2003
Comment MSDC-RI MSDC-RI

Normal alkane RI, non-polar column, temperature ramp

View large format table.

Column type Active phase I Reference Comment
CapillaryDB-52021.Savel'eva, Zenkevich, et al., 200325. m/0.20 mm/0.33 μm, Helium, 40. C @ 1. min, 5. K/min, 270. C @ 15. min
CapillaryDB-52021.Savel'eva, Zenkevich, et al., 200225. m/0.20 mm/0.33 μm, Helium, 40. C @ 1. min, 5. K/min, 270. C @ 15. min

References

Savelieva and Zenkevich I., 2003
Savelieva, E.; Zenkevich I., Analisi GC/MS di agenti chimici nervini, Laboratorio 2000, 2003, 17, 6/7, 24-26. [all data]