Isobutyl vinyl sulfide

Normal alkane RI, non-polar column, temperature ramp

Data compiled by: NIST Mass Spectrometry Data Center, William E. Wallace, director

Column type CapillaryCapillary
Active phase DB-5DB-5
Column length (m) 25.25.
Carrier gas HeliumHelium
Substrate
Column diameter (mm) 0.200.20
Phase thickness (μm) 0.330.33
Tstart (C) 40.40.
Tend (C) 270.270.
Heat rate (K/min) 5.5.
Initial hold (min) 1.1.
Final hold (min) 15.15.
I 847.847.
ReferenceSavel'eva, Zenkevich, et al., 2003Savel'eva, Zenkevich, et al., 2002
Comment MSDC-RI MSDC-RI

References

Savel'eva, Zenkevich, et al., 2003
Savel'eva, E.I.; Zenkevich, I.G.; Radilov, A.S., Identification the Products of Chemical Neutralization of O-Isobutyl-S-(2-diethylaminoethyl)methylthiophosphonate in the Composition of Bitumen-Salt Matrices, Zh. Anal. Khim. (Rus.), 2003, 58, 2, 135-145. [all data]

Savel'eva, Zenkevich, et al., 2002
Savel'eva, E.I.; Zenkevich, I.G.; Kuznetsova, T.A.; Radilov, A.S.; Pshenichnaya, G.V., Investigation of Products of Transformation of Phosphororganic Toxic Substances with Gas Chromatography - Mass Spectrometry, Rus. Khim. Zh. (Rus.), 2002, 56, 6, 82-91. [all data]