GA127 methyl ester TMS ether

Van Den Dool and Kratz RI, non-polar column, custom temperature program

View large format table.

Column type Active phase I Reference Comment
CapillaryHP-12662.Pearce, Hutt, et al., 2002Column length: 12. m; Column diameter: 0.22 mm; Program: 60C(0.5min) => 20C/min => 200C => 5C/min => 300C
CapillaryHP-12663.Pearce, Hutt, et al., 2002Column length: 12. m; Column diameter: 0.22 mm; Program: 60C(0.5min) => 20C/min => 200C => 5C/min => 300C
CapillaryDB-52643.Pearce, Hutt, et al., 2002Column length: 15. m; Column diameter: 0.25 mm; Program: 60C(0.5min) => 20C/min => 200C => 5C/min => 300C
CapillaryDB-52643.Pearce, Hutt, et al., 2002Column length: 15. m; Column diameter: 0.25 mm; Program: 60C(0.5min) => 20C/min => 200C => 5C/min => 300C

References

Pearce, Hutt, et al., 2002
Pearce, D.W.; Hutt, O.E.; Rood, S.B.; Mander, L.N., Gibberellins in shoots and developing capsules of Populus species, Phytochemistry, 2002, 59, 6, 679-687, https://doi.org/10.1016/S0031-9422(02)00009-2 . [all data]