(E)-methyl jasmonate

Normal alkane RI, non-polar column, custom temperature program

View large format table.

Column type Active phase I Reference Comment
CapillaryRTX-51614.ChromTech Pty Ltd, 2006Program: not specified
CapillaryHP-11612.Carpino, Mallia, et al., 200425. m/0.2 mm/0.11 μm; Program: 35C(3min) => 4C/min => 190C => 30C/min => 225C(3min)

References

ChromTech Pty Ltd, 2006
ChromTech Pty Ltd, Retention Data: Rtx-1, Rtx-5, Rtx-50, Rtx-Stab Kovats RI, 2006, retrieved from http://www.chromtech.net.au/pdf/RI-Flavors-20M.pdf. [all data]

Carpino, Mallia, et al., 2004
Carpino, S.; Mallia, S.; La Terra, S.; Melilli, C.; Licitra, G.; Acree, T.E.; Barbano, D.M.; van Soest, P.J., Composition and aroma compounds of ragusano cheese: native pasture and total mixed rations, J. Dairy Sci., 2004, 87, 4, 816-830, https://doi.org/10.3168/jds.S0022-0302(04)73226-9 . [all data]