3-ethoxy-2-butanone

Normal alkane RI, non-polar column, custom temperature program

Data compiled by: NIST Mass Spectrometry Data Center, William E. Wallace, director

Column type Capillary
Active phase HP-1
Column length (m) 50.
Carrier gas N2
Substrate
Column diameter (mm) 0.32
Phase thickness (μm) 0.52
Program 40C => 2C/min => 130C => 4C/min => 250C
I 663.
ReferenceTeai, Claude-Lafontaine, et al., 2001
Comment MSDC-RI

References

Teai, Claude-Lafontaine, et al., 2001
Teai, T.; Claude-Lafontaine, A.; Schippa, C.; Cozzolino, F., Volatile compounds in fresh pulp of pineapple (Ananas comosus [L.] Merr.) from French Polynesia, J. Essent. Oil Res., 2001, 13, 5, 314-318, https://doi.org/10.1080/10412905.2001.9712222 . [all data]