1,(E)-3-(Z)-5-Octatriene

Van Den Dool and Kratz RI, polar column, custom temperature program

Data compiled by: NIST Mass Spectrometry Data Center, William E. Wallace, director

Column type Capillary
Active phase DB-Wax
Column length (m) 30.
Carrier gas He
Substrate
Column diameter (mm) 0.32
Phase thickness (μm) 0.5
Program 50C => 5C/min => 180C => 10C/min => 250C
I 1096.
ReferenceSérot, Regost, et al., 2001
Comment MSDC-RI

References

Sérot, Regost, et al., 2001
Sérot, T.; Regost, C.; Prost, C.; Robin, J.; Arzel, J., Effect of dietary lipid sources on odour-active compounds in muscle of turbot (Psetta maxima), J. Sci. Food Agric., 2001, 81, 14, 1339-1346, https://doi.org/10.1002/jsfa.950 . [all data]