cis-p-menth-4-en-1,2-diol

Normal alkane RI, polar column, custom temperature program

View large format table.

Column type Active phase I Reference Comment
CapillaryHP Innowax FSP2157.Wedge, Klun, et al., 200960. m/0.25 mm/0.25 μm, Helium; Program: 60 0C (10 min) 4 0C/min -> 220 0C (10 min) 1 0C/min -> 240 0C (20 min)
CapillaryHP-Innowax FSC2157.Demirci, Paper, et al., 200460. m/0.25 mm/0.25 μm, He; Program: 60C(10min) => 4C/min => 220C(10min) => 1C/min => 240C
CapillaryInnowax2157.Özcan, Akgül, et al., 200160. m/0.25 mm/0.25 μm, He; Program: 60C(10min) => 4C/min => 200C(10min) => 1C/min => 240C

References

Wedge, Klun, et al., 2009
Wedge, D.E.; Klun, J.A.; Tabanca, N.; Demirci, B.; Ozek, T.; Baser, K.H.C.; Liu, Z.; Zhang, S.; Cantrell, C.L.; Zhang, J., Bioactivity-guided fractionation and GC/MS fingerprinting of Amgelica sinensis and Angelica archangelica root components for antifungal and mosquito deterrent activity, J. Agric. Food Chem., 2009, 57, 2, 464-470, https://doi.org/10.1021/jf802820d . [all data]

Demirci, Paper, et al., 2004
Demirci, F.; Paper, D.H.; Franz, G.; Hüsnü Can Baser, K., Investigation of the origanum onites L. essential oil using the Chorioallantoic Membrane (CAM) assay, J. Agric. Food Chem., 2004, 52, 2, 251-254, https://doi.org/10.1021/jf034850k . [all data]

Özcan, Akgül, et al., 2001
Özcan, M.; Akgül, A.; Bascr, K.H.C.; Özck, T.; Tabanca, N., Essential oil composition of sea fennel (Crithmum maritimum) form Turkey, Nahrung/Food, 2001, 45, 5, 353-356, https://doi.org/10.1002/1521-3803(20011001)45:5<353::AID-FOOD353>3.0.CO;2-4 . [all data]