(Z)-α-Bergamotol

Normal alkane RI, non-polar column, temperature ramp

Data compiled by: NIST Mass Spectrometry Data Center, William E. Wallace, director

Column type Capillary
Active phase RSL-200
Column length (m) 30.
Carrier gas H2
Substrate
Column diameter (mm) 0.32
Phase thickness (μm) 0.25
Tstart (C) 40.
Tend (C) 280.
Heat rate (K/min) 6.
Initial hold (min) 5.
Final hold (min) 5.
I 1692.
ReferenceJirovetz, Buchbauer, et al., 2003
Comment MSDC-RI

Van Den Dool and Kratz RI, non-polar column, custom temperature program

Data compiled by: NIST Mass Spectrometry Data Center, William E. Wallace, director

Column type Capillary
Active phase DB-5
Column length (m)
Carrier gas
Substrate
Column diameter (mm)
Phase thickness (μm)
Program not specified
I 1692.
ReferenceÖzel, Gögüs, et al., 2006
Comment MSDC-RI

References

Jirovetz, Buchbauer, et al., 2003
Jirovetz, L.; Buchbauer, G.; Shafi, M.P.; Leela, N.K., Analysis of the essential oils of the leaves, stems, rhizomes and roots of the medicinal plant Alpinia galanga from southern India, Acta Pharm. Hung., 2003, 53, 73-81. [all data]