Morpholine-2-carboxylic acid, 3-phenyl, methyl ester, cis

Normal alkane RI, non-polar column, temperature ramp

View large format table.

Column type Active phase I Reference Comment
CapillaryOV-1011726.Molchanov, Stepakov, et al., 2001Nitrogen, 60. C @ 0. min, 6. K/min, 240. C @ 0. min; Column length: 25. m; Column diameter: 0.20 mm

References

Molchanov, Stepakov, et al., 2001
Molchanov, A.P.; Stepakov, A.V.; Kopf, J.; Zenkevich, I.G.; Kostikov, R.R., Reaction of Methoxycarbonylcarbene with 3-Ethyl-2-phenyl- and 2,3-Diphenyloxadiazolines, Rus. Chem. Bull. (Int. Edn.), 2001, 50, 11, 2144-2148, https://doi.org/10.1023/A:1015057519648 . [all data]