Benzoyl glucopyranoside, isomer # 3, TFA

Normal alkane RI, non-polar column, temperature ramp

Data compiled by: NIST Mass Spectrometry Data Center, William E. Wallace, director

Column type Capillary
Active phase DB-5
Column length (m) 25.
Carrier gas He
Substrate
Column diameter (mm) 0.25
Phase thickness (μm) 1.
Tstart (C) 125.
Tend (C) 280.
Heat rate (K/min) 3.
Initial hold (min)
Final hold (min) 10.
I 1727.
ReferenceMorales, Duque, et al., 2000
Comment MSDC-RI

References

Morales, Duque, et al., 2000
Morales, A.L.; Duque, C.; Bautista, E., Identification of free and glycosidically bound volatiles and glycosides by capillary GC and capillary GC-MS in Lulo del Chocó (Solanum topiro), J. Hi. Res. Chromatogr., 2000, 23, 5, 379-385, https://doi.org/10.1002/(SICI)1521-4168(20000501)23:5<379::AID-JHRC379>3.0.CO;2-B . [all data]