Benzoyl glucopyranoside, isomer # 1, TFA

Normal alkane RI, non-polar column, temperature ramp

View large format table.

Column type Active phase I Reference Comment
CapillaryDB-51684.Morales, Duque, et al., 200025. m/0.25 mm/1. μm, He, 3. K/min, 280. C @ 10. min; Tstart: 125. C

References

Morales, Duque, et al., 2000
Morales, A.L.; Duque, C.; Bautista, E., Identification of free and glycosidically bound volatiles and glycosides by capillary GC and capillary GC-MS in Lulo del Chocó (Solanum topiro), J. Hi. Res. Chromatogr., 2000, 23, 5, 379-385, https://doi.org/10.1002/(SICI)1521-4168(20000501)23:5<379::AID-JHRC379>3.0.CO;2-B . [all data]