Bisabolol (isomer A)

Van Den Dool and Kratz RI, polar column, temperature ramp

View large format table.

Column type Active phase I Reference Comment
CapillaryDB-Wax2229.Choi and Sawamura, 200060. m/0.25 mm/0.25 μm, N2, 70. C @ 2. min, 2. K/min, 230. C @ 20. min

Normal alkane RI, non-polar column, custom temperature program

View large format table.

Column type Active phase I Reference Comment
CapillaryDB-11646.4Helmig, Revermann, et al., 200330. m/0.32 mm/0.1 μm, He; Program: 40C (2min) => 20C/min => 80C => 3C/min => 145C => 45C/min => 225C (3min)

References

Choi and Sawamura, 2000
Choi, H.-S.; Sawamura, M., Composition of the essential oil of Citrus tamurana Hort. ex Tanaka (Hyuganatsu), J. Agric. Food Chem., 2000, 48, 10, 4868-4873, https://doi.org/10.1021/jf000651e . [all data]

Helmig, Revermann, et al., 2003
Helmig, D.; Revermann, T.; Pollmann, J.; Kaltschmidt, O.; Hernández, A.J.; Bocquet, F.; David, D., Calibration system and analytical considerations for quantitative sesquiterpene measurements in air, J. Chromatogr. A, 2003, 1002, 1-2, 193-211, https://doi.org/10.1016/S0021-9673(03)00619-8 . [all data]