4-Pentenoic acid, 2,3-diethoxy-5-phenyl, ethyl ester

Normal alkane RI, non-polar column, temperature ramp

View large format table.

Column type Active phase I Reference Comment
CapillaryOV-1011866.Zenkevich, Kharicheva, et al., 1999Helium, 60. C @ 0. min, 6. K/min, 240. C @ 0. min; Column length: 25. m; Column diameter: 0.20 mm

References

Zenkevich, Kharicheva, et al., 1999
Zenkevich, I.G.; Kharicheva, E.M.; Kostikov, R.R., Application of Molecular Dynamics Methods in Chromato Mass Spectral Identification of Products of Interaction of Ethoxycarbonylcarbene with Various Substrates, Zh. Org. Khim. (Rus.), 1999, 35, 11, 1600-1606. [all data]