Linalool oxide 2

Kovats' RI, polar column, isothermal

Data compiled by: NIST Mass Spectrometry Data Center, William E. Wallace, director

Column type Capillary
Active phase Carbowax 20M
Column length (m)
Carrier gas
Substrate
Column diameter (mm)
Phase thickness (μm) 0.45
Temperature (C) 150.
I 1513.
ReferenceTudor, Moldovan, et al., 1999
Comment MSDC-RI

References

Tudor, Moldovan, et al., 1999
Tudor, E.; Moldovan, D.; Zârna, N., Temperature dependence of the retention index for perfumery compounds on two carbowax-20M glass capillary columns with different film thickness. 2, Rev. Roum. Chim., 1999, 44, 7, 665-675. [all data]