d3-2E-hexenyl 2-methylbutanoate

Kovats' RI, polar column, custom temperature program

Data compiled by: NIST Mass Spectrometry Data Center, William E. Wallace, director

Column type Capillary
Active phase Carbowax
Column length (m) 30.
Carrier gas
Substrate
Column diameter (mm) 0.25
Phase thickness (μm) 0.25
Program 40C (10min) => 3C/min => 100C => 5C/min => 220C
I 1477.
ReferenceRowan, Allen, et al., 1999
Comment MSDC-RI

References

Rowan, Allen, et al., 1999
Rowan, D.D.; Allen, J.M.; Fielder, S.; Hunt, M.B., Biosynthesis of straight-chain ester volatiles in Red Delicious and Granny Smith apples using deuterium-labeled precursors, J. Agric. Food Chem., 1999, 47, 7, 2553-2562, https://doi.org/10.1021/jf9809028 . [all data]