3Z-hexenol-d2

Kovats' RI, polar column, custom temperature program

View large format table.

Column type Active phase I Reference Comment
CapillaryCarbowax1386.Rowan, Allen, et al., 199930. m/0.25 mm/0.25 μm; Program: 40C (10min) => 3C/min => 100C => 5C/min => 220C

References

Rowan, Allen, et al., 1999
Rowan, D.D.; Allen, J.M.; Fielder, S.; Hunt, M.B., Biosynthesis of straight-chain ester volatiles in Red Delicious and Granny Smith apples using deuterium-labeled precursors, J. Agric. Food Chem., 1999, 47, 7, 2553-2562, https://doi.org/10.1021/jf9809028 . [all data]