(S)-Linalol rutinoside, TFA

Van Den Dool and Kratz RI, non-polar column, custom temperature program

Data compiled by: NIST Mass Spectrometry Data Center, William E. Wallace, director

Column type CapillaryCapillary
Active phase DB-5DB-5
Column length (m) 30.30.
Carrier gas H2H2
Substrate
Column diameter (mm) 0.250.25
Phase thickness (μm) 0.250.25
Program 125C => 3C/min => 220C => 2C/min => 280C125C => 3C/min => 220C => 2C/min => 280C
I 2124.2130.
ReferenceBoulanger, Chassagne, et al., 1999Boulanger, Chassagne, et al., 1999
Comment MSDC-RI MSDC-RI

References

Boulanger, Chassagne, et al., 1999
Boulanger, R.; Chassagne, D.; Crouzet, J., Free and bound flavour components of amazonian fruits. 1: Bacuri, Flavour Fragr. J., 1999, 14, 5, 303-311, https://doi.org/10.1002/(SICI)1099-1026(199909/10)14:5<303::AID-FFJ834>3.0.CO;2-C . [all data]