d14 Cymene

Normal alkane RI, non-polar column, temperature ramp

View large format table.

Column type Active phase I Reference Comment
CapillaryMethyl Silicone1004.20Baraldi, Rapparini, et al., 199960. m/0.25 mm/0.25 μm, 40. C @ 10. min, 5. K/min; Tend: 220. C

References

Baraldi, Rapparini, et al., 1999
Baraldi, R.; Rapparini, F.; Rossi, F.; Latella, A.; Ciccioli, P., Volatile organic compound emissions from flowers of the most occurring and economically important species of fruit trees, Phys. Chem. Earth, 1999, 24, 6, 729-732, https://doi.org/10.1016/S1464-1909(99)00073-8 . [all data]