ent-3β-acetoxy-13-epi-manoyl oxide

Van Den Dool and Kratz RI, non-polar column, temperature ramp

View large format table.

Column type Active phase I Reference Comment
CapillaryHP-5MS2376.Anastasaki, Demetzos, et al., 199930. m/0.25 mm/0.25 μm, 50. C @ 5. min, 3. K/min; Tend: 280. C

Van Den Dool and Kratz RI, polar column, temperature ramp

View large format table.

Column type Active phase I Reference Comment
CapillaryCP-Wax2748.Anastasaki, Demetzos, et al., 199960. m/0.32 mm/0.25 μm, 50. C @ 5. min, 1.5 K/min; Tend: 280. C

References

Anastasaki, Demetzos, et al., 1999
Anastasaki, T.; Demetzos, C.; Perdetzoglou, D.; Gazouli, M.; Loukis, A.; Harvala, C., Analysis of labdane-type diterpenes from Cistus creticus (subsp. creticus and subsp. eriocephalus), by GC and GC-MS, Planta Medica, 1999, 65, 8, 735-739, https://doi.org/10.1055/s-1999-14095 . [all data]