(-)-Silphiperfolan-7β-ol

Normal alkane RI, non-polar column, custom temperature program

View large format table.

Column type Active phase I Reference Comment
CapillaryCP Sil 5 CB1516.Weyerstahl, Marschall, et al., 1998N2; Column length: 25. m; Phase thickness: 0.39 μm; Program: not specified

Normal alkane RI, polar column, custom temperature program

View large format table.

Column type Active phase I Reference Comment
CapillaryDB-Wax1940.Weyerstahl, Marschall, et al., 1998N2; Column length: 60. m; Phase thickness: 0.25 μm; Program: not specified

References

Weyerstahl, Marschall, et al., 1998
Weyerstahl, P.; Marschall, H.; Seelmann, I.; Jakupovic, J., Cameroonane, Prenopsane and Nopsane, Three New Tricyclic Sesquiterpene Skeletons, Eur.J.Org.Chem., 1998, 1998, 6, 1205-1212, https://doi.org/10.1002/(SICI)1099-0690(199806)1998:6<1205::AID-EJOC1205>3.0.CO;2-K . [all data]