(-)-Silphiperfolan-6α-ol

Normal alkane RI, non-polar column, custom temperature program

Data compiled by: NIST Mass Spectrometry Data Center, William E. Wallace, director

Column type Capillary
Active phase CP Sil 5 CB
Column length (m) 25.
Carrier gas N2
Substrate
Column diameter (mm)
Phase thickness (μm) 0.39
Program not specified
I 1501.
ReferenceWeyerstahl, Marschall, et al., 1998
Comment MSDC-RI

References

Weyerstahl, Marschall, et al., 1998
Weyerstahl, P.; Marschall, H.; Seelmann, I.; Jakupovic, J., Cameroonane, Prenopsane and Nopsane, Three New Tricyclic Sesquiterpene Skeletons, Eur.J.Org.Chem., 1998, 1998, 6, 1205-1212, https://doi.org/10.1002/(SICI)1099-0690(199806)1998:6<1205::AID-EJOC1205>3.0.CO;2-K . [all data]