Guaia-3,7-diene

Normal alkane RI, non-polar column, custom temperature program

View large format table.

Column type Active phase I Reference Comment
CapillaryHP-5MS1474.Güllüce, Özer, et al., 200630. m/0.25 mm/0.25 μm, He; Program: 50C(3min) => 3C/min => 150C(10min) => 10C/min => 250C

Normal alkane RI, polar column, temperature ramp

View large format table.

Column type Active phase I Reference Comment
CapillaryHP-Innowax FSC1811.Tümen, Baser, et al., 199860. m/0.25 mm/0.25 μm, He, 60. C @ 10. min, 4. K/min, 220. C @ 10. min

References

Güllüce, Özer, et al., 2006
Güllüce, M.; Özer, H.; Baris, Ö.; Daferera, D.; Sahin, F.; Polissiou, M., Chemical Composition of the Essential Oil of Salvia aethiopis L., Turkish Journal of Biology, 2006, 30, 231-233. [all data]

Tümen, Baser, et al., 1998
Tümen, G.; Baser, K.H.C.; Demirci, B.; Ermin, N., The essential oils of Satureja coerulea Janka and Thymus aznavourii Velen., Flavour Fragr. J., 1998, 13, 1, 65-67, https://doi.org/10.1002/(SICI)1099-1026(199801/02)13:1<65::AID-FFJ695>3.0.CO;2-Q . [all data]