(6R)-5,6-Dihydro-3,6-dimethyl-benzo-[b]-furan-2(4H)-one

Normal alkane RI, polar column, temperature ramp

View large format table.

Column type Active phase I Reference Comment
CapillarySupelcowax2323.Näf and Velluz, 1998He, 5. K/min; Column length: 60. m; Column diameter: 0.25 mm; Tstart: 80. C; Tend: 240. C

References

Näf and Velluz, 1998
Näf, R.; Velluz, A., Phenols and lactones in Italo-Mitcham peppermint oil Mentha × piperita L., Flavour Fragr. J., 1998, 13, 3, 203-208, https://doi.org/10.1002/(SICI)1099-1026(199805/06)13:3<203::AID-FFJ725>3.0.CO;2-0 . [all data]