2-Methyl-5-isopropyl furan

Normal alkane RI, non-polar column, temperature ramp

View large format table.

Column type Active phase I Reference Comment
CapillarySPB-5933.Doneanu and Anitescu, 199850. m/0.32 mm/0.25 μm, He, 3. K/min, 240. C @ 20. min; Tstart: 60. C

References

Doneanu and Anitescu, 1998
Doneanu, C.; Anitescu, G., Supercritical carbon dioxide extraction of Angelica archangelica L. root oil, J. Supercrit. Fluids, 1998, 12, 1, 59-67, https://doi.org/10.1016/S0896-8446(97)00040-5 . [all data]