3,9-Oxy-mentha-1,8(10)-diene

Normal alkane RI, non-polar column, custom temperature program

Data compiled by: NIST Mass Spectrometry Data Center, William E. Wallace, director

Column type CapillaryCapillary
Active phase SE-30Polydimethyl siloxanes
Column length (m)
Carrier gas
Substrate
Column diameter (mm)
Phase thickness (μm)
Program not specifiednot specified
I 1182.1182.
ReferenceVinogradov, 2004Zenkevich, 1997
Comment MSDC-RI MSDC-RI

Normal alkane RI, non-polar column, temperature ramp

View large format table.

Column type Active phase I Reference Comment
CapillaryBP-11168.Boti, Muselli, et al., 200650. m/0.22 mm/0.25 μm, He, 2. K/min, 220. C @ 20. min; Tstart: 60. C

Normal alkane RI, polar column, temperature ramp

View large format table.

Column type Active phase I Reference Comment
CapillaryBP-201551.Boti, Muselli, et al., 200650. m/0.22 mm/0.25 μm, He, 2. K/min, 220. C @ 20. min; Tstart: 60. C

References

Vinogradov, 2004
Vinogradov, B.A., Production, composition, properties and application of essential oils, 2004, retrieved from http://viness.narod.ru. [all data]

Zenkevich, 1997
Zenkevich, I.G., Analytical Parameters of Components of Essential Oils for their Chromatographic and Chromato-Spectral Identificaiton. Oxsigenated derivatives of Mono- and Sesquiterpene Hydrocarbons, Rastit, Resursy (Rus.), 1997, 33, 1, 16-28. [all data]